{"text_format":"1","workbook":"xlsx","n_sheets":13,"sheets":["Overview","graphic","Input","Well P&A Cost Estimate","Rollup_Master","Multiplier Calc_Master","Multi_Well_Estimation","Fac. Dec. & Site Rem. Estimate","Fac. Dec. & Site Rem. Batch","Well Site Rem. Estimate","Well Site Rem. Batch","Contingency Calculation","Cost Summary"],"not_rendered":{"charts":3,"images":12,"macros":1,"external_links":0,"defined_names":6,"comments":6,"pivot_tables":0},"unopened":[],"bounds":{"document_bytes":16777216,"sheet_cells":100000,"rows_first":2000,"rows_last":500,"rows_between":2000,"halvings":0,"cell_chars":16384,"cell_head_chars":4096},"cells_cut":0,"cells_raw":0,"read":"whole","date_system":"1900"}

{"sheet":"Overview","index":0,"n_rows":30,"n_cols":28,"rows_kept":30,"cut":false,"hidden":false,"merged":[]}
[]
[null,null,null,null,null,null,null,null,null,null,null,null,null,null,null,null,null,null,null,null,null,null,null,null,null,null,null,"CalGEM Contact Information"]
[null,null,null,null,null,null,null,null,null,null,null,null,null,null,null,null,null,null,null,null,null,null,null,null,null,null,null,"costestimation@conservation.ca.gov"]
[]
[]
[]
[]
[]
[]
[]
[]
[]
[]
[]
[]
{"$rows_left_out":16}
{"sheet":"graphic","index":1,"n_rows":0,"n_cols":0,"rows_kept":0,"cut":false,"hidden":true,"merged":[]}

{"sheet":"Input","index":2,"n_rows":57,"n_cols":4,"rows_kept":57,"cut":false,"hidden":true,"merged":[[1,3,5,5]]}
[]
[]
[]
[]
[]
[]
[]
[null,"Select Location \nType"]
[]
[null,"Operator Name:",null,"C Case Company"]
[]
[null,"Operator Code:",null,"X1234"]
[]
[null,"Region",null,"Inland"]
[]
{"$rows_left_out":43}
{"sheet":"Well P&A Cost Estimate","index":3,"n_rows":53,"n_cols":25,"rows_kept":53,"cut":false,"hidden":false,"merged":[]}
[]
[null,null,null,null,null,null,null,null,null,null,"Well Plug and Abandonment Cost Estimate",null,null,null,null,null,null,null,null,null,null,null,"References"]
[]
[null,null,null,null,null,null,null,null,"Well Depth (ft)",null,null,null,null,3000,{"$f":"IF(N4<1001,X22,IF(AND(N4>1000, N4<3001), X23, IF(AND(N4>3000, N4<5001), X24,X25)))","v":4},null,null,null,{"$f":"X25","v":10}]
[]
[null,null,null,null,null,null,null,null,"Number of Casing Strings",null,null,null,null,2,{"$f":"IF(N6<3,X28,IF(AND(N6>2, N6<5), X29, X30))","v":0},null,null,null,{"$f":"X30","v":8}]
[]
[null,null,null,null,null,null,null,null,"Risk Factors",null,null,null,null,null,"Weight",null,null,null,null,null,null,null,"Selection"]
[]
[null,null,null,null,null,null,null,null,"Well Location",null,null,null,null,null,null,null,null,null,{"$f":"SUM(S11:S14)","v":27},null,null,null,null,"N"]
[null,null,null,null,null,null,null,null,"Critical well as defined by Section 1720, within city limit or urban area as defined by Section 1760 ",null,null,null,null,"Y",{"$f":"IF(N11=\"Y\",S11,0)","v":10},null,null,null,10,{"$f":"S11/$S$10","v":0.37037037037037035},null,null,null,"Y"]
[null,null,null,null,null,null,null,null,"Environmentally sensitive wellhead as defined in Section 1760 ",null,null,null,null,"N",{"$f":"IF(N12=\"Y\",S12,0)","v":0},null,null,null,7,{"$f":"S12/$S$10","v":0.25925925925925924}]
[null,null,null,null,null,null,null,null,"Located in an area of known geologic hazard including subsidence, landslide, or history of damage to the well from seismicity ",null,null,null,null,"N",0,null,null,null,5,0.18518518518518517]
[null,null,null,null,null,null,null,null,"Surface obstacles preventing access such as buildings, structures, surface-use, roads, irrigation systems, and terrain ",null,null,null,null,"Y",5,null,null,null,5,0.18518518518518517]
[]
{"$rows_left_out":39}
{"sheet":"Rollup_Master","index":4,"n_rows":76,"n_cols":8,"rows_kept":76,"cut":false,"hidden":true,"merged":[[0,3,0,5],[20,1,20,5],[32,1,32,5],[13,2,13,3],[5,2,5,3]]}
[null,null,null,"Well Plug and Abandonment Cost Estimate"]
[null,"Well Plug and Abandonment Cost Estimate"]
[]
[null,"Base Case",null,null,null,"Benchmark"]
[]
[null,"Region Name",{"$f":"Input!D14","v":"Inland"},null,"P&A Time (days)",{"$f":"VLOOKUP(C6,B49:C52,2,)","v":14.2}]
[]
[null,null,null,null,"Cost ($/day)",{"$f":"VLOOKUP(C6,B49:E52,4,)","v":4000}]
[]
[null,null,null,null,"Cost ($/ft)",{"$f":"VLOOKUP(C6,B49:F52,5,)","v":14}]
[]
[null,"Candidate Well"]
[]
[null,"Well Name",{"$f":"Input!D23","v":"Cabrillo 1"},null,"Well Depth (ft)",{"$f":"'Well P&A Cost Estimate'!N4","v":3000}]
[]
{"$rows_left_out":62}
{"sheet":"Multiplier Calc_Master","index":5,"n_rows":58,"n_cols":9,"rows_kept":58,"cut":false,"hidden":true,"merged":[]}
[]
[null,"Range","x","y"]
[null,"Low","High","Max Multiplier","Slope","Intercept","Lower Bound"]
[null,null,0,1]
[null,0,10,1,null,null,0,null,{"$f":"C6-B6","v":39}]
[null,11,50,1.5,{"$f":"(D6-D5)/(C6-C5)","v":1.2500000000000001E-2},{"$f":"D5","v":1},{"$f":"C5","v":10},null,{"$f":"C7-B7","v":19}]
[null,51,70,2,{"$f":"(D7-D6)/(C7-C6)","v":2.5000000000000001E-2},{"$f":"D6","v":1.5},{"$f":"C6","v":50}]
[null,null,85,{"$f":"D7","v":2}]
[]
[null,"Adjusted Rating calculation"]
[null,"Rating","Maltiplier Max","Slope","Intercept","Lower Bound","Delta","Adjusted Rating"]
[null,{"$f":"'Well P&A Cost Estimate'!N29","v":45},{"$f":"IF($B12>=$B$7, $D$7, IF( $B12 >=$B$6, $D$6, $D$5) )","v":1.5},{"$f":"IF($B12>=$B$7, $E$7, IF( $B12 >=$B$6, $E$6, $E$5) )","v":1.2500000000000001E-2},{"$f":"IF($B12>=$B$7,$F$7,IF($B12>=$B$6,$F$6,$F$5))","v":1},{"$f":"IF($B12>=$B$7, $G$7, IF( $B12 >=$B$6, $G$6, $G$5) )","v":10},{"$f":"B12-F12","v":35},{"$f":"IF($B12<B$6,  $D$5,  IF($B12 >= $C$7, $D$7,  $G12*$D12+$E12))","v":1.4375}]
[]
[null,"Well Score","Multiplier",null,"Slope","Intercepth","LB","Delta"]
[null,0,{"$f":"IF(B15<$B$6,  $D$5,  IF(B15 >= $C$7, $D$7,  H15*E15+F15))","v":1},null,{"$f":"IF($B15>=$B$7,$E$7,IF($B15>=$B$6,$E$6,$E$5))","v":0},{"$f":"IF($B15>=$B$7,$F$7,IF($B15>=$B$6,$F$6,$F$5))","v":0},{"$f":"IF($B15>=$B$7,$G$7,IF($B15>=$B$6,$G$6,$G$5))","v":0},{"$f":"B15-G15","v":0}]
{"$rows_left_out":44}
{"sheet":"Multi_Well_Estimation","index":6,"n_rows":27,"n_cols":60,"rows_kept":27,"cut":false,"hidden":false,"merged":[]}
[]
[]
[null,null,null,null,null,null,null,null,null,null,null,null,"Well Plug and Abandonment Cost Estimation"]
["`",null,null,null,null,null,null,null,null,null,null,null,null,null,null,null,null,null,null,null,null,null,null,null,null,null,null,null,null,null,null,null,null,null,null,null,"Batch Template"]
[]
[]
[null,null,null,null,null,null,null,null,null,null,null,null,null,null,null,null,null,null,null,null,null,null,null,null,null,null,null,null,null,null,null,null,null,null,null,null,null,"Well Factors",null,null,null,null,null,null,null,null,"Risk Factors"]
[]
[null,null,null,null,null,null,null,null,null,"Do not fill",null,null,null,"Computed Fields - DO NOT FILL OUT",null,null,null,null,null,null,null,null,null,null,null,null,null,null,null,null,null,null,"Computed Fields - DO NOT FILL OUT",null,null,null,null,null,null,null,null,"Well Location",null,null,null,null,"Well Conditions",null,null,null,null,null,"Other Enviromental / Safety Concerns"]
["S/N","Region","Operator / Company","Field","Lease","Well Name","API #","Spud Date","P&A Start Date","P&A Year","P&A End Date","total depth",null,"Base Daily Well Cost","Well Abandonment Cost","Facilities Removal Cost","T&M Cost","Total Cost","Base Well Days","P&A Days","P&A Days/1000 ft","$/ft (original)","$/ft ™","Total Cost per foot","Total Cost / Day","CalEPA EnviroScreen Score","Other relevant information - Comment","API - old","Lat, Long","LAT","Long","Well Age","Age Range","Well File","Wellbore Info","# of Csg",null,"Age Factor","Well Depth Factor","Casing Factor",null,"Critical well - located within city limit or near an urban area","Well has an environmentally sensitive wellhead","Located in an area of known geologic hazard, such as subsidence, landslides, or a history of damage to wells in the area from seismicity","Well has surface obstacles preventing access e.g. buildings or structures, surface-use activities, irrigation systems, roads, terrain",null,"Unknown - no public records available","Well has pressure in the casing or tubing at the surface","Well has inadequate casing / tubing intergrity ","Well contains junk or other downhole issues such as stuck rods, packer, scales in casing, or fish that require special tools for intervention. ","Well fluid level is above the base of freshwater or USDW",null,"Risk of Spill","Risk to marine or agriculture","Presence of H2S or CO2 production or any envromental conditions that potentially poses a threat to life, health, or property",null,"Simulated Score","Simulated Score Multiplier factor","Simulated Well Days","Simulated Well Cost"]
[null,null,null,null,null,null,null,null,null,null,null,null,null,null,null,null,null,null,null,null,null,null,null,null,null,null,null,null,null,null,null,null,null,null,null,null,null,5,10,8,null,10,7,7,5,null,25,4,6,9,4,null,5,null,5]
[1,"Inland","ABC-XYZ","Santa Maria Valley","Acquistapace","\"Ophelia\" 1","011-20148","1980-05-03","2018-07-23",{"$f":"YEAR(K12)","v":2018},"2018-08-04",1000,null,{"$f":"VLOOKUP(B12,Rollup_Master!$B$49:$E$52,4)","v":4000},null,null,57434.61,{"$f":"SUM(N12:Q12)","v":61434.61},{"$f":"VLOOKUP(B12,Rollup_Master!$B$49:$C$52,2)","v":14.2},{"$f":"K12-I12","v":12},{"$f":"(T12/L12)*1000","v":12},{"$f":"IFERROR(N12/L12,\"\")","v":4},{"$f":"IFERROR(Q12/L12,\"\")","v":57.434609999999999},{"$f":"IFERROR(R12/L12,\"\")","v":61.434609999999999},{"$f":"R12/T12","v":5119.5508333333337},null,"Parted tubing, recovered tubing fish and packer",{"$f":"_xlfn.CONCAT(LEFT(G12,3),RIGHT(G12,5))","v":"01120148"},"(39.06291580, -121.89774323)",34.871967320000003,-120.35132599000001,{"$f":"IFERROR((I12-H12)/365,\"\")","v":38.246575342465754},{"$f":"IF(AF12>50,\"50+\",IF(AND(AF12<50, AF12>25),\"25-50\",IF(AF12<25,\"0-25\")))","v":"25-50"},{"$f":"HYPERLINK((_xlfn.CONCAT(\"ftp://ftp.consrv.ca.gov/pub/oil/WellRecord/\",LEFT(G12,3),\"/\",AB12)),\"Well File\")","v":"Well File"},null,2,null,{"$f":"VLOOKUP(AG12,Rollup_Master!$B$63:$C$65,2)","v":3},{"$f":"IF(L12<1001,Rollup_Master!$C$68,IF(AND(L12>1000, L12<3001),Rollup_Master!$C$69, IF(AND(L12>3000, L12<5001),Rollup_Master!$C$70,Rollup_Master!$C$71)))","v":0},{"$f":"IF(AJ12<3,Rollup_Master!$C$74,IF(AND(AJ12>2, AJ12<5),Rollup_Master!$C$75,Rollup_Master!$C$76))","v":0},null,"N","N","N","N",null,"Y","Y","Y","N","N",null,"N",null,"N",null,{"$f":"SUMIF(AP12:BC12,\"Y\",$AP$11:$BC$11)+SUM(AL12:AN12)","v":38},1.2250000000000001,{"$f":"BF12*S12-1","v":16.395},{"$f":"BG12*N12","v":65580}]
[2,"Inland","ABC-XYZ","Santa Maria Valley","Acquistapace","\"Yellow Rose\" 1","011-20710","2004-12-04","2015-02-10",2015,"2015-02-18",7322,null,{"$f":"VLOOKUP(B13,Rollup_Master!$B$49:$E$52,4)","v":4000},null,null,57435.61,61435.61,{"$f":"VLOOKUP(B13,Rollup_Master!$B$49:$C$52,2)","v":14.2},8,1.0925976509150503,0.54629882545752528,7.8442515706091234,8.390550396066649,7679.4512500000001,null,"Parted tubing, recovered tubing fish and packer","01120710","(39.16454315, -122.00582123)",34.87102127,-120.34874725,{"$f":"IFERROR((I13-H13)/365,\"\")","v":10.191780821917808},{"$f":"IF(AF13>50,\"50+\",IF(AND(AF13<50, AF13>25),\"25-50\",IF(AF13<25,\"0-25\")))","v":"0-25"},"Well File",null,5,null,{"$f":"VLOOKUP(AG13,Rollup_Master!$B$63:$C$65,2)","v":0},{"$f":"IF(L13<1001,Rollup_Master!$C$68,IF(AND(L13>1000, L13<3001),Rollup_Master!$C$69, IF(AND(L13>3000, L13<5001),Rollup_Master!$C$70,Rollup_Master!$C$71)))","v":10},{"$f":"IF(AJ13<3,Rollup_Master!$C$74,IF(AND(AJ13>2, AJ13<5),Rollup_Master!$C$75,Rollup_Master!$C$76))","v":8},null,"Y","Y","N","N",null,"Y","N","N","Y","Y",null,"N","N","Y",null,{"$f":"SUMIF(AP13:BC13,\"Y\",$AP$11:$BC$11)+SUM(AL13:AN13)","v":78},1.9750000000000001,{"$f":"BF13*S13","v":28.044999999999998},112179.99999999999]
[3,"Inland","ABC-XYZ","Santa Maria Valley","Bettiga","\"Transcmerica-Maggiora\" 2","013-20020","1968-03-20","2013-07-09",2013,"2013-07-26",3911,null,{"$f":"VLOOKUP(B14,Rollup_Master!$B$49:$E$52,4)","v":4000},null,null,57436.61,61436.61,{"$f":"VLOOKUP(B14,Rollup_Master!$B$49:$C$52,2)","v":14.2},17,4.3467143952953204,1.0227563283047814,14.685914088468422,15.708670416773204,3613.9182352941175,null,"This whole contract was squirlley.  The WA Hamell was done out of hand without a bid so I cannont atest to the efficacy of the numbers, but they're close.  ","01320020","(37.94747162, -121.73941803)",34.93188095,-120.40383147999999,45.334246575342469,"25-50","Well File",null,4,null,{"$f":"VLOOKUP(AG14,Rollup_Master!$B$63:$C$65,2)","v":3},{"$f":"IF(L14<1001,Rollup_Master!$C$68,IF(AND(L14>1000, L14<3001),Rollup_Master!$C$69, IF(AND(L14>3000, L14<5001),Rollup_Master!$C$70,Rollup_Master!$C$71)))","v":7},{"$f":"IF(AJ14<3,Rollup_Master!$C$74,IF(AND(AJ14>2, AJ14<5),Rollup_Master!$C$75,Rollup_Master!$C$76))","v":4},null,"Y",{"$f":"AP14","v":"Y"},"N","N",null,"N","N","Y","N","N",null,"N","N","N",null,37,1.3374999999999999,17.992499999999996,71969.999999999985]
[4,"Inland","ABC-XYZ","Santa Maria Valley","Bettiga","\"Transcmerica-Maggiora\" 3","013-20021","1948-03-20","2013-07-09",{"$f":"YEAR(K15)","v":2017},"2017-08-29",4500,null,{"$f":"VLOOKUP(B15,Rollup_Master!$B$49:$E$52,4)","v":4000},null,null,57437.61,{"$f":"SUM(N15:Q15)","v":61437.61},{"$f":"VLOOKUP(B15,Rollup_Master!$B$49:$C$52,2)","v":14.2},{"$f":"K15-I15","v":1512},{"$f":"(T15/L15)*1000","v":336},{"$f":"IFERROR(N15/L15,\"\")","v":0.88888888888888884},{"$f":"IFERROR(Q15/L15,\"\")","v":12.763913333333333},{"$f":"IFERROR(R15/L15,\"\")","v":13.652802222222222},{"$f":"R15/T15","v":40.633339947089951},null,"This whole contract was squirlley.  The WA Hamell was done out of hand without a bid so I cannont atest to the efficacy of the numbers, but they're close.  ",{"$f":"_xlfn.CONCAT(LEFT(G15,3),RIGHT(G15,5))","v":"01320021"},"(37.94747162, -121.73941803)",34.93188095,-120.40383147999999,{"$f":"IFERROR((I15-H15)/365,\"\")","v":65.347945205479448},{"$f":"IF(AF15>50,\"50+\",IF(AND(AF15<50, AF15>25),\"25-50\",IF(AF15<25,\"0-25\")))","v":"50+"},{"$f":"HYPERLINK((_xlfn.CONCAT(\"ftp://ftp.consrv.ca.gov/pub/oil/WellRecord/\",LEFT(G15,3),\"/\",AB15)),\"Well File\")","v":"Well File"},null,5,null,{"$f":"VLOOKUP(AG15,Rollup_Master!$B$63:$C$65,2)","v":5},{"$f":"IF(L15<1001,Rollup_Master!$C$68,IF(AND(L15>1000, L15<3001),Rollup_Master!$C$69, IF(AND(L15>3000, L15<5001),Rollup_Master!$C$70,Rollup_Master!$C$71)))","v":7},{"$f":"IF(AJ15<3,Rollup_Master!$C$74,IF(AND(AJ15>2, AJ15<5),Rollup_Master!$C$75,Rollup_Master!$C$76))","v":8},null,"Y",{"$f":"AP15","v":"Y"},"N","N",null,"N","N","Y","N","N",null,"N","N","N",null,{"$f":"SUMIF(AP15:BC15,\"Y\",$AP$11:$BC$11)+SUM(AL15:AN15)","v":43},1.4125000000000001,{"$f":"BF15*S15-1","v":19.057500000000001},{"$f":"BG15*N15","v":76230}]
{"$rows_left_out":13}
{"sheet":"Fac. Dec. & Site Rem. Estimate","index":7,"n_rows":82,"n_cols":17,"rows_kept":82,"cut":false,"hidden":false,"merged":[]}
[]
[]
[]
[null,null,null,null,null,null,"Production Facility Decommissioning & Site Remediation Cost Estimation"]
[]
[]
[]
[null,"Operator Name:",null,"Generic Oil Company"]
[null,"Operator Code:",null,"X1234"]
[null,"Lease Name:",null,"Lease Name"]
[null,"Facility Type:",null,"Setting, Sump, Pipeline, etc"]
[null,"Facility Location:",null,"Coordinates"]
[null,"Subject ID:",null,"12345678"]
[null,"Contact Name:",null,"Operator Contact"]
[null,"Contact Email Address:",null,"Operator Contact Email"]
{"$rows_left_out":68}
{"sheet":"Fac. Dec. & Site Rem. Batch","index":8,"n_rows":66,"n_cols":37,"rows_kept":66,"cut":false,"hidden":false,"merged":[]}
[]
[]
[null,null,null,null,null,null,null,null,null,null,null,"Production Facility Decommissioning & Site Remediation Cost Estimation"]
[null,null,null,null,null,null,null,null,null,null,null,null,null,null,null,"Batch Template"]
[]
[]
[null,"Operator Name:",null,"Generic Oil Company",null,null,null,null,null,null,null,null,null,null,null,null,null,null,"Contact Email Address:",null,null,null,"Operator Contact Email"]
[null,"Operator Code:",null,"X1234",null,null,null,null,null,null,null,null,null,null,null,null,null,null,"Contact Phone Number:",null,null,null,"Operator Contact Phone"]
[null,"Contact Name:",null,"Operator Contact Name",null,null,null,null,null,null,null,null,null,null,null,null,null,null,"Date:",null,null,null,"Date"]
[]
[null,null,"Production Facility Information",null,null,null,null,null,null,null,null,"Production Facility Decommissioning",null,null,null,null,null,null,null,null,null,"               Production Facility Site Remediation",null,null,null,null,null,null,"                  Other Project Components",null,null,null,null,null,"     WellSTAR Input"]
[null,"Field","Lease","Facility Type","Subject ID",null,"Tanks (>10,001 bbl)","Tanks (5,001 - 10,000 bbl)\n or Urban","Tanks (2,500 - 5,000 bbl)","Tanks (<2,499 bbl)","Vessels","Above-Ground Pipelines","Buried Pipelines","Electrical Vaults & \nEquipment","Asphalt & Concrete","Pumps & Compressors","Buildings",null,"Tanks (>10,001 bbl)","Tanks (5,001 - 10,000 bbl)\n or Urban","Tanks (2,500 - 5,000 bbl)","Tanks (<2,499 bbl)","Vessels","Sumps & Auxiliary Holes","Refuse Removal","Access Roads \nRemoval & Restoration",null,"Contingency","Permitting & Regulatory \nCompliance","Mobilization & \nDemobilization","Project Management & Engineering",null,"Facilities Decommissioning \nTotal Cost","Site Remediation \nTotal Cost","Facilities Decommissioning \nTotal Cost","Site Remediation \nTotal Cost","Total Cost"]
[null,null,null,null,"Unit Cost",null,159803.76909032167,104563.87990686214,65311.563872681858,19148.514757018511,12620.916000000001,29.712102498530697,12.057599882956806,389.61212121212117,9.72067133670655,4385.7895977011494,30.445924999999999,null,120308.94304559106,54344.752830883597,21450.376061581355,6549.2233850874309,6549.2233850874309,3.8646610872651932,137.1,2.2475965100858062]
[null,null,null,null,"Unit",null,"EA","EA","EA","EA","EA","LF","LF","TON","CF","EA","SF",null,"EA","EA","EA","EA","EA","CF","CY","CF"]
[null,"Field Name","Lease Name","Setting",12345678,null,1,1,1,1,1,750,500,10,1000,1,1000,null,{"$f":"G15","v":1},{"$f":"H15","v":1},{"$f":"I15","v":1},{"$f":"J15","v":1},{"$f":"K15","v":1},1000,100,1000,null,0.1,0.05,0.05,0.08,null,{"$f":"((G15*$G$13)+(H15*$H$13)+(I15*$I$13)+(J15*$J$13)+(K15*$K$13)+(L15*$L$13)+(M15*$M$13)+(N15*$N$13)+(O15*$O$13)+(P15*$P$13)+(Q15*$Q$13))+(((G15*$G$13)+(H15*$H$13)+(I15*$I$13)+(J15*$J$13)+(K15*$K$13)+(L15*$L$13)+(M15*$M$13)+(N15*$N$13)+(O15*$O$13)+(P15*$P$13)+(Q15*$Q$13))*AB15)+(((G15*$G$13)+(H15*$H$13)+(I15*$I$13)+(J15*$J$13)+(K15*$K$13)+(L15*$L$13)+(M15*$M$13)+(N15*$N$13)+(O15*$O$13)+(P15*$P$13)+(Q15*$Q$13))*AC15)+(((G15*$G$13)+(H15*$H$13)+(I15*$I$13)+(J15*$J$13)+(K15*$K$13)+(L15*$L$13)+(M15*$M$13)+(N15*$N$13)+(O15*$O$13)+(P15*$P$13)+(Q15*$Q$13))*AD15)+(((G15*$G$13)+(H15*$H$13)+(I15*$I$13)+(J15*$J$13)+(K15*$K$13)+(L15*$L$13)+(M15*$M$13)+(N15*$N$13)+(O15*$O$13)+(P15*$P$13)+(Q15*$Q$13))*AE15)","v":560908.83531365078},{"$f":"((S15*$S$13)+(T15*$T$13)+(U15*$U$13)+(V15*$V$13)+(W15*$W$13)+(X15*$X$13)+(Y15*$Y$13)+(Z15*$Z$13))+(((S15*$S$13)+(T15*$T$13)+(U15*$U$13)+(V15*$V$13)+(W15*$W$13)+(X15*$X$13)+(Y15*$Y$13)+(Z15*$Z$13))*AB15)+(((S15*$S$13)+(T15*$T$13)+(U15*$U$13)+(V15*$V$13)+(W15*$W$13)+(X15*$X$13)+(Y15*$Y$13)+(Z15*$Z$13))*AC15)+(((S15*$S$13)+(T15*$T$13)+(U15*$U$13)+(V15*$V$13)+(W15*$W$13)+(X15*$X$13)+(Y15*$Y$13)+(Z15*$Z$13))*AD15)+(((S15*$S$13)+(T15*$T$13)+(U15*$U$13)+(V15*$V$13)+(W15*$W$13)+(X15*$X$13)+(Y15*$Y$13)+(Z15*$Z$13))*AE15)","v":293151.7136711448},{"$f":"ROUND(AG15,0)","v":560909},{"$f":"ROUND(AH15,0)","v":293152},{"$f":"ROUND(SUM(AI15:AJ15),0)","v":854061}]
{"$rows_left_out":52}
{"sheet":"Well Site Rem. Estimate","index":9,"n_rows":71,"n_cols":16,"rows_kept":71,"cut":false,"hidden":false,"merged":[]}
[]
[]
[]
[null,null,null,null,null,null,null,null,null,"Well Site Remediation Cost Estimation"]
[]
[]
[]
[null,"Operator Name:",null,"Generic Oil Company"]
[null,"Operator Code:",null,"X1234"]
[null,"Lease Name:",null,"Lease Name"]
[null,"Field Name:",null,"Field Name"]
[null,"Well Type:",null,"Oil & Gas, Multi-Purpose, Water Disposal, etc."]
[null,"Subject ID:",null,"12345678"]
[null,"Contact Name:",null,"Operator Contact"]
[null,"Contact Email Address:",null,"Operator Contact Email",null,null,null,null,null,null,null,null," "]
{"$rows_left_out":57}
{"sheet":"Well Site Rem. Batch","index":10,"n_rows":66,"n_cols":23,"rows_kept":66,"cut":false,"hidden":false,"merged":[]}
[]
[]
[null,null,null,null,null,null,null,null,"Well Site Remediation Cost Estimation"]
[null,null,null,null,null,null,null,null,null,null,"Batch Template"]
[]
[]
[null,"Operator Name:",null,{"$f":"'Fac. Dec. & Site Rem. Batch'!D7","v":"Generic Oil Company"},null,null,null,null,null,null,null,null,"Contact Email Address:",null,{"$f":"'Fac. Dec. & Site Rem. Batch'!W7","v":"Operator Contact Email"}]
[null,"Operator Code:",null,{"$f":"'Fac. Dec. & Site Rem. Batch'!D8","v":"X1234"},null,null,null,null,null,null,null,null,"Contact Phone Number:",null,{"$f":"'Fac. Dec. & Site Rem. Batch'!W8","v":"Operator Contact Phone"}]
[null,"Contact Name:",null,{"$f":"'Fac. Dec. & Site Rem. Batch'!D9","v":"Operator Contact Name"},null,null,null,null,null,null,null,null,"Date:",null,"Date"]
[]
[null,null,"           Well Information",null,null,null,null,"Well Site Equipment Removal",null,null,null,null,null,"Well Site Remediation",null,null,"       Other Project Components",null,null,null,null,null,"WellSTAR Input"]
[null,"Field","Lease","Well Type","Subject ID",null,"Above-Ground Pipelines","Buried Pipelines","Electrical Vaults & \nEquipment","Asphalt & Concrete","Pumps",null,"Wellhead","Well Cellars","Refuse Removal",null,"Contingency","Permitting & Regulatory \nCompliance","Mobilization & \nDemobilization","Project Management & Engineering",null,"Site Remediation \nTotal Cost","Site Remediation \nTotal Cost"]
[null,null,null,null,"Unit Cost",null,29.712102498530697,12.057599882956806,389.61212121212117,9.72067133670655,4385.7895977011494,null,10158.034921482978,8540.2148275862055,137.1]
[null,null,null,null,"Unit",null,"LF","LF","TON","CF","EA",null,"EA","EA","CY"]
[null,"Field Name","Lease Name","Oil & Gas",12345678,null,100,50,2,300,1,null,1,1,10,null,0.1,0.05,0.05,0.08,null,{"$f":"((G15*$G$13)+(H15*$H$13)+(I15*$I$13)+(J15*$J$13)+(N15*$N$13)+(K15*$K$13)+(M15*$M$13)+(O15*$O$13))+(((G15*$G$13)+(H15*$H$13)+(I15*$I$13)+(J15*$J$13)+(N15*$N$13)+(K15*$K$13)+(M15*$M$13)+(O15*$O$13))*Q15)+(((G15*$G$13)+(H15*$H$13)+(I15*$I$13)+(J15*$J$13)+(N15*$N$13)+(K15*$K$13)+(M15*$M$13)+(O15*$O$13))*R15)+(((G15*$G$13)+(H15*$H$13)+(I15*$I$13)+(J15*$J$13)+(N15*$N$13)+(K15*$K$13)+(M15*$M$13)+(O15*$O$13))*S15)+(((G15*$G$13)+(H15*$H$13)+(I15*$I$13)+(J15*$J$13)+(N15*$N$13)+(K15*$K$13)+(M15*$M$13)+(O15*$O$13))*T15)","v":40607.430699785546},{"$f":"ROUND(V15,0)","v":40607}]
{"$rows_left_out":52}
{"sheet":"Contingency Calculation","index":11,"n_rows":25,"n_cols":9,"rows_kept":25,"cut":false,"hidden":false,"merged":[]}
[]
[]
[]
[null,null,"                               Production Facility Decommissioning & Site Remediation Contingency Calculation"]
[]
[]
[]
[null,"Production Facility and Site Location Characteristics",null,null,"Yes/No","Score",null,"Weight","Description"]
[]
[null,null,"Production facility is located in an environmentally sensitive, as defined in sensitive, or urban area, as defined in Section 1760 ",null,"No",{"$f":"IF(E10=\"Yes\",\"10\",\"0\")","v":"0"},null,10,"As defined in § 1760 of the Statues & Regulations"]
[null,null,"Any other conditions that potentially pose a threat to life, health, property, or natural resources ",null,"No",{"$f":"IF(E11=\"Yes\",\"10\",\"0\")","v":"0"},null,10,"Any other conditions that pose a threat to life, health, property, or natural resources "]
[null,null,"History of spills and/or leaks; unlined sumps",null,"No",{"$f":"IF(E12=\"Yes\",\"10\",\"0\")","v":"0"},null,10,"Risk of increased soil contamination."]
[null,null,"Original land type has freshwater aquifer underneath",null,"No",{"$f":"IF(E13=\"Yes\",\"5\",\"0\")","v":"0"},null,5,"Contamination concern into freshwater aquifer"]
[null,null,"Production facility location is in an area of known geologic hazards including subsidence, landslides, or seismicity ",null,"No",{"$f":"IF(E14=\"Yes\",\"5\",\"0\")","v":"0"},null,5,"Facility is located in an area of known geologic hazards, such as subsidence, landslides, or a history of \ndamage to wells and facilities in the area from seismicity."]
[null,null,"Surface obstacles preventing access such as buildings, structures, surface-use, roads, irrigation systems, terrain ",null,"No",{"$f":"IF(E15=\"Yes\",\"5\",\"0\")","v":"0"},null,5,"Facility location has surface obstacles or other impediments preventing access to the location, including but not limited to surface-use activities, irrigation systems, roads, terrain, or restricted access."]
{"$rows_left_out":11}
{"sheet":"Cost Summary","index":12,"n_rows":16,"n_cols":30,"rows_kept":16,"cut":false,"hidden":true,"merged":[[3,3,3,5],[1,3,1,5]]}
[]
[null,null,null,"Cost Estimate Summary\n- Operator Liability Report - ",null,null,null,null,null,"References"]
[]
[null,null,null,"Cost"]
[]
[null,"S/N","Type","P&A/Decommissioning","Site Remmediation","Total"]
[null,1,"Well",{"$f":"'Well P&A Cost Estimate'!R53","v":81649.999999999985},17512,{"$f":"D7+E7","v":99161.999999999985}]
[null,2,"Facility",87114,25000,{"$f":"D8+E8","v":112114}]
[null,3,"Lease",null,null,0]
[]
[]
[null,null,"Total",null,null,{"$f":"SUM(F7:F10)","v":211276}]
[]
[null,null,null,null,null,null,null,null,null,null,null,null,null,null,"Existing","Facility","90299477","Temescal","Setting","Active","10","Coastal","Temescal","Temescal","03, 04N, 18W, SB",null,"N",null,null,{"$f":"IF(OR(AB14<>\"\",AC14<>\"\"),TEXT(SUM(VALUE(AB14),VALUE(AC14)),\"$#,##0.00\"),\"\")","v":""}]
[null,null,null,null,null,null,null,null,null,null,null,null,null,null,"Existing","Facility","90319516","OOS Tank Facility","Setting","Idle","2","Coastal","Temescal","Temescal","10, 04N, 18W, SB",null,"N",null,null,""]
{"$rows_left_out":1}